{"text_format":"2","workbook":"xlsx","n_sheets":2,"sheets":["Sheet1","Sheet2"],"not_rendered":{"charts":0,"images":2,"macros":0,"external_links":0,"defined_names":0,"comments":0,"pivot_tables":0},"unopened":[],"bounds":{"document_bytes":16777216,"sheet_cells":100000,"run_cost":"one","rows_first":2000,"rows_last":500,"rows_between":2000,"halvings":0,"cell_chars":16384,"cell_head_chars":4096},"cells_cut":0,"cells_raw":0,"read":"whole","date_system":"1900"}

{"sheet":"Sheet1","index":0,"n_rows":78,"n_cols":26,"rows_kept":78,"cut":false,"hidden":false,"merged":[]}
{"$rows_empty":11}
[null,"你在sheet2按下F9,每按一次F9，就看到你眼下要复习的科目，那就动手吧"]
[null,null,"重要的是行动，是你的主动思考和行动，动手吧！"]
[null,null,"学到一定阶段就可以换一个科目来复习咯，你再次按动F9"]
[null,null,"接受自己现状；做一些自己可以控制的事情：你能积极行动，就能表扬自己"]
[null,null,"保证营养，增减衣物。不熬夜，晚上11：00之前睡觉。早上7：00起床。中午小睡半小时。"]
[null,null,"考完之后通过http://bbs.mysipo.com/thread-524984-1-1.html来聚会happy。现在请加油吧。"]
[null,null,"本神器作者 siceng——联系方式6909502@qq.com"]
[null,null,null,"2017-08-18"]
{"$rows_empty":20}
[{"$nulls":24},1,"民法"]
[{"$nulls":24},2,"刑法"]
[{"$nulls":24},3,"行政法"]
[{"$nulls":24},4,"商经"]
[{"$nulls":24},5,"民诉"]
[{"$nulls":24},6,"刑诉"]
[{"$nulls":24},7,"理论法"]
[{"$nulls":24},8,"三国"]
{"$rows_empty":7}
[{"$nulls":24},1,"看书或听网络或面授课"]
[{"$nulls":24},2,"刷真题或模拟题，看解析"]
[{"$nulls":24},3,"写备考日记或打卡"]
[{"$nulls":24},4,"提问或回答"]
[{"$nulls":24},5,"做成套卷子，掐时间模拟考试"]
[{"$nulls":24},6,"将错题考点总结进薄讲义，整理自己的模板"]
[{"$nulls":24},7,"背诵总结了考点的薄讲义，背模板"]
[{"$nulls":24},8,"手写练习卷四"]
{"$rows_empty":8}
[{"$nulls":24},1,"转发锦鲤"]
[{"$nulls":24},2,"拜文殊菩萨"]
[{"$nulls":24},3,"学雷锋攒人品"]
[{"$nulls":24},4,"献血"]
[{"$nulls":24},5,"口念“必过吧”"]
[{"$nulls":24},6,"血战拼搏"]
[{"$nulls":24},7,"背水一战"]
[{"$nulls":24},8,"每晚虔诚点蚊香"]

{"sheet":"Sheet2","index":1,"n_rows":17,"n_cols":3,"rows_kept":17,"cut":false,"hidden":false,"merged":[]}
[null,"我们是谁？","司考勇士"]
[]
["开玩笑，","怎么考过？",{"$f":"VLOOKUP(INT(1+RAND()*8),Sheet1!Y71:Z78,2,0)","v":"学雷锋攒人品"}]
[]
["讲真，","学什么科目？",{"$f":"VLOOKUP(INT(1+RAND()*8),Sheet1!Y40:Z47,2,0)","v":"民诉"}]
[]
["讲真，","怎么学？",{"$f":"VLOOKUP(INT(1+RAND()*8),Sheet1!Y55:Z62,2,0)","v":"背诵总结了考点的薄讲义，背模板"}]
[]
[]
["你在sheet2按下F9,每按一次F9，就看到你眼下要复习的内容，那就动手吧"]
["重要的是行动，是你的主动思考和行动，动手吧！"]
["学到一定阶段就可以换一个科目来复习咯，你再次按动F9"]
["接受自己现状；做一些自己可以控制的事情：你能积极行动，就能表扬自己"]
["保证营养，增减衣物。不熬夜，晚上11：00之前睡觉。早上7：00起床。中午小睡半小时。"]
["考完之后通过http://bbs.mysipo.com/thread-524984-1-1.html来聚会happy。现在请加油吧。"]
["本神器作者 siceng——联系方式6909502@qq.com"]
[null,"2017-08-18"]